Home > Error Code > Win32 Error Code 1332

Win32 Error Code 1332

Contents

ERROR_NO_EVENT_PAIR 581 A Windows Server has an incorrect configuration. ERROR_ILLEGAL_DLL_RELOCATION 624 {DLL Initialization Failed} The application failed to initialize because the window station is shutting down. ERROR_DRIVER_FAILED_SLEEP 634 The system file %1 has become corrupt and has been replaced. Tried .\username also and that too failed. –Shashi Mar 13 '14 at 16:10 I've found that for a user account local to the machine, specifying '.\username' does not work get redirected here

ERROR_BUSY_DRIVE 143 The system cannot join or substitute a drive to or for a directory on the same drive. ERROR_CONNECTION_UNAVAIL 1202 The local device name has a remembered connection to another network resource. A complete synchronization is required. CONTINUE READING Join & Write a Comment Already a member?

Windows Error Codes List

ERROR_PROFILING_AT_LIMIT 554 Used to indicate that an operation cannot continue without blocking for I/O. ERROR_DEBUG_ATTACH_FAILED 591 {Fatal System Error} The %hs system process terminated unexpectedly with a status of 0x%08x (0x%08x 0x%08x). The calling process has not registered as a logon process. 1363 Cannot start a new logon session with an ID that is already in use. 1364 A specified authentication package is Please contact your system administrator. 1270 The smartcard certificate used for authentication has expired.

ERROR_BACKUP_CONTROLLER 587 An attempt was made to acquire a mutant such that its maximum count would have been exceeded. ERROR_FULLSCREEN_MODE 1008 An attempt was made to reference a token that does not exist. The registry could not read in, or write out, or flush, one of the files that contain the system's image of the registry. 1017 The system has attempted to load or Windows Error Codes And Solutions Pdf ERROR_PATH_BUSY 149 An attempt was made to join or substitute a drive for which a directory on the drive is the target of a previous substitute.

ERROR_ADDRESS_ALREADY_ASSOCIATED 1228 An address has not yet been associated with the network endpoint. Windows Error Codes Lookup ERROR_PATH_NOT_FOUND 4 The system cannot open the file. ERROR_DIRECT_ACCESS_HANDLE 131 An attempt was made to move the file pointer before the beginning of the file. ERROR_BADKEY 1011 The configuration registry key could not be opened.

ERROR_TOO_MANY_NAMES 69 The network BIOS session limit was exceeded. Error 1392 The File Or Directory Is Corrupted And Unreadable ERROR_NETWORK_ACCESS_DENIED 66 The network resource type is not correct. Default group is "jenkins" but it doesn't exist in my current Windows VM. ERROR_INVALID_DEVICE_OBJECT_PARAMETER 651 A Machine Check Error has occurred.

Windows Error Codes Lookup

Steps to Reproduce: I am using the below code to achieve my objective - jenkins_windows_slave "#{node['fqdn']}" do description "#{node['platform']} - #{node['platform_version']}" remote_fs 'E:/jenkins' labels ['test2015'] executors 1 user service_user password service_password ERROR_INVALID_SERVICE_CONTROL 1053 The service did not respond to the start or control request in a timely fashion. Windows Error Codes List ERROR_EAS_NOT_SUPPORTED 288 Attempt to release mutex not owned by caller. Windows Error Codes 0x Contact your support personnel. ERROR_INSTALL_LOG_FAILURE 1622 (0x656) Error opening installation log file.

Either it is retried after the containing onode is moved or the extent stream is converted to a large stream. Get More Info ERROR_INVALID_SEGDPL 199 The operating system cannot run this application program. They are returned by the GetLastError function when many functions fail. ERROR_NOT_ALL_ASSIGNED 1300 (0x514) Not all privileges or groups referenced are assigned to the caller. ERROR_SOME_NOT_MAPPED 1301 (0x515) Some mapping between account names and security IDs was not done. ERROR_NO_QUOTAS_FOR_ACCOUNT Windows Blue Screen Error Codes

This error may be caused by a failure of your computer hardware or network connection. ERROR_DRIVER_FAILED_PRIOR_UNLOAD 655 {Volume Shadow Copy Service} Please wait while the Volume Shadow Copy Service prepares volume %hs for hibernation. Why is this C++ code faster than my hand-written assembly for testing the Collatz conjecture? http://downloadmunkey.net/error-code/windows-error-code-0f00-1332.php Reload to refresh your session.

ERROR_MEDIA_CHANGED 1111 The I/O bus was reset. Error Code 1332 Join Domain Apparently this was fixed with PR# #333, but its again broken somewhere down the line. ERROR_INVALID_LIST_FORMAT 154 The volume label you entered exceeds the label character limit of the target file system.

ERROR_LOST_WRITEBEHIND_DATA_LOCAL_DISK_ERROR 791 The resources required for this device conflict with the MCFG table.

ERROR_FILE_NOT_FOUND 3 The system cannot find the path specified. Already identified as #241 I haven't seen that error when I used v1.2.X Further details: recipe [acme::slave] jenkins_windows_slave node['fqdn'] do description 'Runs a series of high-level smoke tests' remote_fs "C:/jenkins" labels with 10 years’ experience in the planning, design, and implementation of network technologies. System Error Code 1400 Invalid Window Handle ERROR_INVALID_DOMAINNAME 1213 The format of the specified service name is invalid.

ERROR_DRIVERS_LEAKING_LOCKED_PAGES 730 The system has awoken. ERROR_SHUTDOWN_IS_SCHEDULED 1191 The system shutdown cannot be initiated because there are other users logged on to the computer. ERROR_CANTOPEN 1012 The configuration registry key could not be read. http://downloadmunkey.net/error-code/win32-error-code-14.php ERROR_INVALID_DRIVE 16 The directory cannot be removed.

For a multi-byte character set this includes a lead byte without a succeeding trail byte. Go to System in the Control Panel to change the computer name and try again. 53 The network path was not found. 54 The network is busy. 55 The specified network ERROR_INVALID_EXE_SIGNATURE 192 The operating system cannot run %1. ERROR_INVALID_ORDINAL 183 Cannot create a file when that file already exists.

Browse other questions tagged windows-7-x64 or ask your own question. ERROR_DRIVER_CANCEL_TIMEOUT 595 {Reply Message Mismatch} An attempt was made to reply to an LPC message, but the thread specified by the client ID in the message was not waiting on that Then let’s try again same command. This is secure, but may be incompatible with previous releases of the operating system.

ERROR_SUBST_TO_SUBST 140 The system tried to join a drive to a directory on a substituted drive.